☰
AXI_LITE总线协议详解:从机设计、Verilog实现与调试避坑指南
2026/10/15 1:39:51 网站建设 项目流程

做Zynq、做FPGA SoC集成,或者只是想把一段自定义逻辑挂到ARM核旁边跑起来的人,大概率都绕不开一个名字:AXI_LITE。这个总线协议可以说是AMBA家族里最亲民的一员,没有完整AXI那么多突发、乱序、多重未完成交易的高级玩法,也没有AXI_Stream那样彻底扔掉地址概念、只管一路狂奔的数据流气质。它就像小区门口那种规规矩矩的单车道——每次只允许一辆车通过,但好在规则清晰、成本低、足够可靠。

这篇文章我想从一个常年手写总线从机的人的角度,把AXI_LITE总线读写的协议细节、从机设计思路、可综合代码实现和实际调试中踩过的坑串起来聊一遍。适合刚接触AXI_LITE、需要自己写一个从机IP,或者已经在调试AXI_LITE接口但对时序细节还有点模糊的嵌入式工程师和FPGA开发者。内容不需要你有很深的数字IC背景,但至少得知道寄存器、时钟、复位这些基础概念。读完你会有能力自己写一个干净的AXI_LITE从机,并且知道出问题的时候该从哪里下手查。

1. 为什么是AXI_LITE:从AMBA家族里挑一个“刚刚好”的协议

1.1 完整AXI、AXI_LITE和AXI_Stream,到底差在哪

AXI_LITE是AMBA 4.0规范中AXI协议的精简版本。拿它和标准AXI放一起对比,最直观的差异就是数据传输模式。标准AXI支持突发传输,一次地址握手之后可以连续传多笔数据,这个“突发长度”由AWLEN/ARLEN信号指定,还能支持乱序完成、多个未完成事务同时挂着。这套机制服务于高带宽场景,比如DDR控制器、DMA搬运,它追求的是“一趟高速公路上能并排跑很多车”。

AXI_LITE则完全不同,它的突发长度被固定为1,每笔事务只有一次地址握手和一次数据握手,没有乱序、没有多笔未完成。它的一切设计都围绕“简单可靠”展开,信号数量比标准AXI也少了一大截,从机逻辑做起来自然清爽。想象一下标准AXI是一套完整的交通系统,红绿灯、立交桥、应急车道一应俱全;那AXI_LITE就是村口那条双向两车道,虽然吞吐量没法比,但管理成本低到几乎可以忽略。

AXI_Stream又是另外一个极端,它干脆把地址通道整个去掉,只剩下数据流从一个点持续灌向另一个点。适合视频流、高速数据采集这类没有随机访问需求的场景。所以三者分工很明确:要随机地址访问、数据量不大、却又需要精细控制的时候,AXI_LITE就是那个刚刚好的选项。

特性完整AXIAXI_LITEAXI_Stream
地址通道有(AW/AR)有(AW/AR)无
突发传输支持,长度可配固定长度1连续流式
乱序/多笔未完成支持不支持无此概念
典型场景DDR、高速存储、DMA寄存器控制、外设配置数据搬运、视频/采集流
从机实现复杂度高低低

1.2 AXI_LITE的适用场景与典型应用

从我实际接触的项目看,AXI_LITE最常见的身份就是“寄存器访问总线”。无论是ARM处理器通过互联访问FPGA里的控制寄存器,还是FPGA内部主设备与低速外设之间的配置通道,AXI_LITE都是第一选择。典型场景包括:

  • Zynq平台上的PS端通过AXI_LITE访问PL端自定义IP。比如一个外设控制器,PS启动后往寄存器里写模式字、读状态位,全部是32位字粒度的小事务,吞吐量要求极低,但访问延迟的确定性要求高。
  • SoC里内部低速外设挂在互连矩阵上。比如GPIO、UART配置寄存器、定时器控制字,这些外设天然不需要突发,甚至不希望被突发访问,AXI_LITE屏蔽了突发概念之后,外设逻辑可以写得非常直接。
  • 跨时钟域的小数据量控制信息交换。比如两个不同时钟域模块之间传递控制指令,用AXI_LITE做协议层,内部再用异步FIFO或双口RAM做数据交换,整个方案思路非常清晰。

我有一次做一个电机控制子系统,ARM侧要求通过AXI总线配置六个PWM周期的寄存器。最开始某同事建议直接用完整AXI接口,理由是互联网络统一。但我算了一笔账:整块逻辑只有十几个寄存器,最高配置频率也就几十千赫兹,CPU通过总线事务的速率低到完全可以忽略。用完整AXI意味着要处理突发长度、应答延迟可变、数据交错等一大堆对场景毫无贡献的复杂度,纯属给自己加工作量。最后统一用AXI_LITE挂到互连矩阵上,代码量少了差不多一半,功能完全满足需求,后端时序也轻松很多。

1.3 协议选型的“为什么”:多快好省的权衡

有人可能会问,既然完整AXI能覆盖AXI_LITE的全部功能,为什么不一律用完整AXI?答案就藏在“成本”两个字里。

  • 逻辑面积成本:完整AXI从机需要实现突发计数器、多笔未完成缓冲区、应答顺序跟踪,这些在AXI_LITE里统统不需要。对于寄存器数量有限的外设,AXI_LITE从机做出来可能比完整AXI从机小30%以上。
  • 时序收敛成本:完整AXI的握手路径更复杂,尤其在互联网络上做跨时钟域同步时,突发状态机会带来额外的时序风险。AXI_LITE的每个事务都是原子的,一个握手周期完成后事务即结束,后端约束写起来简单得多。
  • 验证成本:AXI_LITE的协议规则比完整AXI少很多,断言覆盖更容易写全面。做验证的人应该都有体会,完整AXI的乱序场景构造起来要命,AXI_LITE基本就是顺序读写,心智负担小一大截。

这套“够用就好”的哲学贯穿整个嵌入式系统设计:不是每个模块都需要高性能,低性能模块用高性能总线反而是在制造无谓的复杂度。AXI_LITE的价值不在于它能做什么,而在于它让“不需要做什么”成为默认事实。

2. 协议核心机制拆解:五个通道的握手逻辑

2.1 双向握手协议VALID/READY

AXI协议族的所有通道都建立在同一种握手机制上:源端拉高VALID表示本通道上数据有效,目的端拉高READY表示自己可以接收数据,两边同时在时钟上升沿采样到VALID和READY都为高,这笔传输就在这个时钟沿完成。规则看起来简单,但背后有两条硬性约束必须严格遵循。

第一,VALID一旦拉高,就不能在没有完成握手之前把它降下来,必须一直保持到目的端给出READY、双方完成传输。这条规则的物理含义是“数据一经送出,发送方不得撤回”,确保接收端永远不需要为“等了一拍的数据突然消失”这种异常兜底。

第二,VALID不能依赖READY,即源端不能在等待READY为高之后才拉VALID。可以理解为“发送方要先把自己的货摆上柜台,才能等客户来取”。反过来READY可以依赖VALID,接收方看到VALID来了再拉READY完全合法。这两条规则合在一起从根上杜绝了“我在等你你先等我”的死锁局面。

用生活类比解释:VALID是你按响的门铃,READY是屋里人开门的手。你可以一直按着门铃不撒手(VALID保持),屋里的人想好了再开门(READY可以晚);但你不能等人家先开门才伸手去按门铃(VALID不能依赖READY)。规则粗看简单,实际工程中很多死锁都是因为某侧信号被组合逻辑绕了一圈,变成了变相的“等待对方先动作”,这种问题仿真时特别容易漏掉。

2.2 写通道的三段式流程(AW/W/B)

AXI_LITE的写操作由三个通道串成一条流水线:写地址通道(AW)、写数据通道(W)、写响应通道(B)。

  • 写地址通道:主设备拉高AWVALID并给出写地址AWADDR。从机准备好后拉高AWREADY。两边在时钟沿握手成功,地址被从机采样进来。AWPROT信号属于保护属性,简单从机通常直接忽略,拉低即可。
  • 写数据通道:主设备拉高WVALID并给出写数据WDATA和字节使能WSTRB。从机WREADY为高时完成握手,数据被锁存。这里有个AXI_LITE特有的细节:它不像完整AXI那样有WLAST信号,因为每笔事务只有一个数据拍,不需要靠WLAST标记最后一笔。从机一旦和W通道握手成功,意味着这一笔写数据已经收讫。
  • 写响应通道:数据写入完毕之后,从机拉高BVALID并给出写响应BRESP。主设备准备好接收则拉高BREADY,握手成功后整个写事务结束。BRESP只有两种常用取值:写成功是OKAY(2‘b00),写失败或地址译码错误是SLVERR(2’b10)。简单从机只要没有可上报的错误,固定返回OKAY即可。

这里要特别注意的是写地址握手和写数据握手这两条通道相互独立,没有先后顺序约束。主设备可以先把地址发出去,数据晚几拍再到;也可以数据先到,地址后到。因为从机内部并不知道这笔事务的地址和数据的到达顺序,所以必须在从机里分别对AW和W握手状态打标记,两边都就绪之后才提交真正的寄存器写入,否则会出现“数据到了却没有地址可以用”的尴尬。

2.3 读通道的两段式流程(AR/R)

读操作比写操作少一个响应通道,整个流程由读地址通道(AR)和读数据通道(R)两段组成。

  • 读地址通道:主设备拉高ARVALID并给出ARADDR,从机准备就绪后拉高ARREADY,握手成功,地址被锁存。
  • 读数据通道:从机根据锁存的地址把对应寄存器的值放到RDATA上,同时拉高RVALID。主设备准备好后拉高RREADY,握手成功,数据被主设备采走,读事务结束。RRESP信号表示读响应,含义和BRESP一致。

读通道最关键的一点:RVALID必须在AR通道握手之后才能拉高。因为从机要先把地址译码出来才能选通数据,如果地址还没锁存就先把数据摆上RDATA,读到的东西就是无意义的。从机设计里通常用一个内部标志位记录“AR是否已经握手完成”,标志置位后下一拍拉RVALID并输出读数据。

2.4 通道间的依赖与顺序约束

AXI_LITE通道间的依赖关系可以用一句话概括:写响应B必须等待写地址AW和写数据W都完成之后才能发起,读数据R必须等待读地址AR完成后才能发起。除此之外通道与通道之间没有强制顺序。

这两个约束背后的逻辑都很直接:B通道回答的是“这笔写事务是否完成”,总得先确认地址和数据都到了,寄存器确实被写了,才能给主设备一个令人信服的完成信号;R通道返回的数据是地址译码出来的,地址没到就没数据。

但B通道到底什么时候拉高,不同从机实现会有细微差别。有的从机在地址和数据都锁存的下一拍就拉BVALID,把寄存器写入动作同时完成;有的从机会等写入动作真正落定后再拉BVALID。前者响应延迟短,适合对延迟敏感的主设备;后者设计上更稳妥,因为回给主设备的“完成”确实发生在数据写入之后。我自己的习惯是选择前者,在提交写入的同一拍拉BVALID,AXI_LITE事务的原子性保证主设备收到响应后下笔事务发出时,上一笔数据必然已经可见。

3. 从机设计前的准备工作:地址映射与寄存器规划

3.1 从地址映射看设计边界

在动手写代码之前,先把地址映射表定义清楚。AXI_LITE从机的地址通常由互联层统一分配一个基地址,从机内部只对地址的低位做译码。典型的做法是把地址按32位字对齐,也就是最低两位作为字节偏移,从机用AWADDR[3:2]或更高位来做寄存器选择。

举例来说,一个带4个32位寄存器的从机,寄存器偏移可以规划为:

偏移地址寄存器名读写属性功能描述
0x00控制寄存器读写使能位、模式配置位
0x04状态寄存器只读硬件状态、中断标志
0x08数据寄存器读写通用数据交换
0x0C保留只读/固定0预留,读回0

地址译码采用“高优先级挡非法地址”的方式。比如AWADDR[3:2]只有四种取值,分别对应四个寄存器,译码default分支落入保留地址或非法地址。规范一些的做法是在default分支返回SLVERR响应并拒绝写入,但很多简单从机为了省逻辑直接返回OKAY、数据写到黑洞里。从验证和排错的角度,建议至少对保留地址返回一个固定0的读结果,这样软件读保留地址时不会读到随机X态。

3.2 寄存器布局与字节使能(WSTRB)陷阱

WSTRB是AXI_LITE里最容易被人忽视却最容易出bug的信号。它一共4位,WSTRB[3:0]分别表示WDATA的第[31:24]、[23:16]、[15:8]、[7:0]这4个字节是否有效。主设备发起一笔记账写操作时,如果把WSTRB置为4’b1111,写入整字;如果置为4‘b0001,就只写最低字节。

问题出在:写数据通道的握手一旦成功,WDATA上的数据不论WSTRB为哪一位有效,整条32位数据都同时在总线上。如果从机的写逻辑直接把WDATA整字写入寄存器,那些WSTRB为0的字节就会被意料之外地改写。假设一个寄存器的高位是只读状态字段,软件只想改低8位,把WSTRB置为4’b0001,从机如果忽略WSTRB直接把整32位写入,硬件状态字段就被软件数据污染了。

正确做法是写寄存器时按字节使能过滤:

if (w_strb_tmp[0]) reg_ctrl[7:0] <= w_data_tmp[7:0]; if (w_strb_tmp[1]) reg_ctrl[15:8] <= w_data_tmp[15:8]; if (w_strb_tmp[2]) reg_ctrl[23:16] <= w_data_tmp[23:16]; if (w_strb_tmp[3]) reg_ctrl[31:24] <= w_data_tmp[31:24];

这条规则要说三遍都不为过:写寄存器之前务必核对WSTRB。尤其是在Zynq这类平台,处理器访问外设时驱动可能以字节、半字、字的粒度进行读写,WSTRB的取值什么花样都有。如果不处理,轻则寄存器数据错乱,重则把硬件状态位写脏,排查起来极其折磨人。

3.3 状态机设计思路:主从两侧的时序约定

从机设计要回答一个基本问题:什么时候访存,什么时候响应。我的建议是读通道和写通道各自维护独立的状态机,两者互不干扰。原因很简单,读写本来就是两个独立的事物流,合并到一个状态机里会增加互锁条件,代码写完过一周自己都很难看懂。

写通道状态机核心三个状态:等待AW握手、等待W握手、发送B响应。读通道核心两个状态:等待AR握手、发送R数据。状态之间的跳转严格遵循AXI_LITE协议,不能自定义优先级,不能跳着来。

主设备一侧的时序约定也很明确:主设备发出AWVALID与WVALID之后,必须保持它们直到握手完成。从机设计不用担心主设备会在握手前撤销信号,协议保证了这一点。而从机的回应则可以晚来,普通从机通常会在地址和数据都收到后的下一拍拉BVALID,这个延迟在AXI_LITE里完全合法,主设备会一直等。

有了清晰的状态机和地址映射,代码写起来是流水线式的快感。大多数从机写两周左右就能稳定跑起来,其中用来纠结状态机的时间往往不超过一天,真正耗时的是后面联调时冒出来的一堆“这不是协议问题但你就是查不出来”的诡异现象。

4. 核心代码实现:一个可综合的AXI_LITE从机

4.1 写通道FSM实现(含代码)

下面这份Verilog代码是我在项目里常用的一套AXI_LITE从机写通道实现,风格偏保守,全部采用同步时序控制握手信号,没有组合逻辑毛刺风险,也容易在仿真里按要求加断言。

写通道首先用两个内部标志aw_done和w_done分别记录地址通道和数据通道的握手结果。握手完成后锁存地址和数据,两者都为高后提交寄存器写入,同时拉BVALID。

// 写地址锁存 reg [31:0] aw_addr; reg aw_done; reg w_done; reg [31:0] w_data_tmp; reg [3:0] w_strb_tmp; reg bvalid; always @(posedge S_AXI_ACLK or negedge S_AXI_ARESETN) begin if (!S_AXI_ARESETN) begin aw_addr <= 32'd0; aw_done <= 1'b0; w_done <= 1'b0; w_data_tmp <= 32'd0; w_strb_tmp <= 4'd0; bvalid <= 1'b0; end else begin // 写地址握手 if (S_AXI_AWVALID && S_AXI_AWREADY) begin aw_addr <= S_AXI_AWADDR; aw_done <= 1'b1; end // 写数据握手 if (S_AXI_WVALID && S_AXI_WREADY) begin w_data_tmp <= S_AXI_WDATA; w_strb_tmp <= S_AXI_WSTRB; w_done <= 1'b1; end // 提交写操作并产生写响应 if (aw_done && w_done && !bvalid) begin bvalid <= 1'b1; // 根据地址和w_strb_tmp执行寄存器写入 end // 完成写响应 if (bvalid && S_AXI_BREADY) begin bvalid <= 1'b0; aw_done <= 1'b0; w_done <= 1'b0; end end end assign S_AXI_AWREADY = !aw_done && !bvalid; assign S_AXI_WREADY = !w_done && !bvalid; assign S_AXI_BVALID = bvalid; assign S_AXI_BRESP = 2'b00;

这里有一个值得展开的细节:aw_done和w_done并不会在握手完成后立刻归零,而是等到整个事务的B响应完成之后才一起清零。这么设计的原因很简单,从机事务尚未结束,如果提前释放地址和数据锁存标志,很可能下一笔新事务的地址和数据到达时,上一笔事务还没提交写入,从机内部就会发生数据覆盖。把标志的生命周期延续到B响应完成,就能保证从机在同一时间点只跟踪一笔写事务。代价自然也有,那就是从机不支持多个未完成的写事务同时在流水线上跑。对于AXI_LITE的典型应用场景,这点吞吐量损失完全无所谓,换取的是代码简单、行为可预期。

提交写入动作的位置在aw_done && w_done && !bvalid这个分支中,和置位bvalid发生在同一个分支。用非阻塞赋值的话,寄存器写入实际上会在下一拍才生效,也就是说BVALID拉高的那拍,主设备还没收到响应,但寄存器的值已经更新了(只是更新动作在非阻塞赋值语义下完成于同拍末,对主设备不可见)。到主设备下一拍看到BVALID并拉BREADY时,寄存器数据早就是写入之后的值了,所以不会出现“响应完成时数据还没写好”的问题。

4.2 读通道FSM实现(含代码)

读通道比写通道简单,AR握手完成后锁存地址,然后下一拍即可拉RVALID并输出读数据,等待RREADY完成握手。

reg ar_done; reg [31:0] ar_addr; reg rvalid; reg [31:0] rdata_tmp; always @(posedge S_AXI_ACLK or negedge S_AXI_ARESETN) begin if (!S_AXI_ARESETN) begin ar_done <= 1'b0; ar_addr <= 32'd0; rvalid <= 1'b0; end else begin // 读地址握手 if (S_AXI_ARVALID && S_AXI_ARREADY) begin ar_addr <= S_AXI_ARADDR; ar_done <= 1'b1; end // 响应完成 if (rvalid && S_AXI_RREADY) begin rvalid <= 1'b0; ar_done <= 1'b0; end // 发起读响应 if (ar_done && !rvalid) begin rvalid <= 1'b1; end end end assign S_AXI_ARREADY = !ar_done && !rvalid; assign S_AXI_RVALID = rvalid; always @(*) begin case (ar_addr[3:2]) 2'b00: rdata_tmp = reg_ctrl; 2'b01: rdata_tmp = reg_status; 2'b10: rdata_tmp = reg_data; 2'b11: rdata_tmp = 32'd0; // 保留 default: rdata_tmp = 32'd0; endcase end assign S_AXI_RDATA = rdata_tmp; assign S_AXI_RRESP = 2'b00;

从时序上看,ar_done置位的下一拍rvalid拉高,同时rdata_tmp已经根据ar_addr组合选通了寄存器值。主设备看到RVALID后拉RREADY,完成握手,事务结束。这里RDATA是一个纯组合多路选择器输出,因为读数据在AR握手完成后就应该立刻可见,不能拖到寄存器阶段。

值得提醒的是:如果读数据来自某些需要等待的硬件状态,比如从异步FIFO读数据或从慢速外设采样寄存器,组合译码就不够用了。这种场景需要在RVALID之前增加“数据准备好”条件,让从机在数据真正可用之后再拉RVALID。AXI协议允许从机任意延迟RVALID,只要地址握手已经完成。

4.3 顶层模块与信号连接

两个通道的状态机通过寄存器堆联系在一起。写通道负责写寄存器,读通道负责选通寄存器。完整顶层模块还需要夹在AXI信号名和内部逻辑之间做命名转换,工程习惯是用S_AXI_前缀标识从机端口,信号含义一目了然。

module axi_lite_slave #( parameter DATA_WIDTH = 32 )( input wire S_AXI_ACLK, input wire S_AXI_ARESETN, input wire [31:0] S_AXI_AWADDR, input wire S_AXI_AWVALID, output wire S_AXI_AWREADY, input wire [31:0] S_AXI_WDATA, input wire [DATA_WIDTH/8-1:0] S_AXI_WSTRB, input wire S_AXI_WVALID, output wire S_AXI_WREADY, output wire [1:0] S_AXI_BRESP, output wire S_AXI_BVALID, input wire S_AXI_BREADY, input wire [31:0] S_AXI_ARADDR, input wire S_AXI_ARVALID, output wire S_AXI_ARREADY, output wire [DATA_WIDTH-1:0] S_AXI_RDATA, output wire [1:0] S_AXI_RRESP, output wire S_AXI_RVALID, input wire S_AXI_RREADY );

我习惯把顶层模块里的reg和wire命名严格镜像AXI信号名,比如aw_done对应写地址通道握手完成,w_done对应写数据通道握手完成。这个方法在调试时极其方便:用波形查看器打开模块内部信号,一眼就能看出到底是地址没握手成功还是数据没握手成功,不需要在模块名和信号名之间做映射推断。

4.4 仿真验证与仿真波形检查要点

写完代码之后不要急着上板,先用testbench把时序推演清楚。最基础的测试流程只需要三步:发一笔写事务、发一笔读事务、对读回值和写入值做比对。

Testbench激励的关键在于控制握手节奏。建议至少覆盖三种情况:地址和数据同时握手成功、地址先到数据后到、数据先到地址后到。三种情况中后两种最能暴露从机的锁存逻辑缺陷。比如数据先到时,WVALID和WREADY握手成功但aw_done还是0,数据被锁存到w_data_tmp;等到地址通道握手完成后,从机才把标志都置起来。这套流程在仿真里走通了,写通道基本就没有协议问题。

仿真波形检查要盯四个关键点:

  • 复位释放后所有VALID信号为低,READY信号为高(从机空闲可接收)。
  • 写事务中AWVALID与AWREADY有交叠的高电平周期,WVALID与WREADY同理,BVALID在两者之后出现。
  • 读事务中ARVALID握手后,RVALID必须晚于AR握手出现,不能提前。
  • 写寄存器后立刻发起读请求,读到的必须是写入后的值。

有个仿真陷阱常遇到:Testbench里以为“先发AWVALID再发WVALID”就按照顺序执行,其实两个握手本身是独立并行的。一旦地址握手在数据握手前完成,从机没事;反过来则必须等地址到达才能提交。仿真里如果发现从机卡在某个状态不完全推进,十有八九是主设备侧的握手信号依赖了不存在的条件,比如等待一个不会到来的WLAST。

5. 常见问题与排查技巧实录

5.1 死锁场景一:VALID等READY,READY等VALID

AXI握手协议虽然从规则上禁止了“双方互相等待”的死锁,但工程实现里死锁并不罕见。最常见的原因是有人把READY信号用组合逻辑直接依赖了对面的VALID,又在对侧用组合逻辑把VALID依赖了这边的READY。举个例子,从机代码里写assign AWREADY = AWVALID && internal_not_full,这个写法本身没问题,因为READY可以依赖VALID。但主机那边如果恰好写了assign AWVALID = AWREADY && cmd_valid这种代码,问题就冒出来了:两边都在等对方的“先动作信号”,时钟沿到来时谁都不会先拉高。

这类问题在纯仿真环境里不一定会立刻暴露,因为有的仿真器会做不定态处理,波形上一片X;有的则会死锁在仿真的某一拍。排查手段是拉出AWVALID、AWREADY两个信号,看它们是否曾经在同一时钟沿都小于等于一个周期地交叠。如果始终没有交叠且互等,那就要去翻主设备侧的总线逻辑,看看有没有做等效的“等待READY才拉VALID”。

我自己的经验法则是:主设备侧的VALID必须由状态机锁存,不能由组合逻辑直接生成;从机侧的READY可以组合生成,但也建议在状态机里同步产生,方便仿真时加断点。

5.2 时序收敛问题:组合逻辑链过长

AXI_LITE从机虽然信号少,但当寄存器数量很多时,读数据通道的组合MUX会变得很庞大。比如一个从机挂了64个32位寄存器,RDATA的组合选择器要经过6级左右的case分支,综合出来之后组合路径延迟可能超过100MHz时钟的限制。公共的互联路径如果还要叠加跨时钟域同步、读写仲裁等逻辑,时序收敛就会开始报警。

解决办法有两类。第一类是加流水:读地址握手完成后,不要立刻以组合方式输出RDATA,而是先用一拍锁存选中寄存器的地址或直接锁存读数据,再在下一拍输出。代价是读延迟从1拍变成2拍,对AXI_LITE应用来说完全可接受。第二类是缩地址译码宽度:把寄存器分成几个bank,每个bank单独译码,再在bank之间做二级选择,降低单个MUX的扇入。如果寄存器数量真大到需要这么优化,通常说明这个从机的功能规模已经不适合用AXI_LITE挂了,该考虑换完整AXI或者拆分接口。

5.3 复位与初始值:看不见的坑

AXI标准要求ARESETN是异步复位、同步释放。工程上如果直接用全局异步复位信号做所有寄存器的异步置位,可能会在复位释放时出现亚稳态。简单对治是用两级同步器打出rst_n_sync作为内部复位置位信号,再把这个信号接到所有寄存器的异步复位端。

寄存器初始值也很容易踩坑。很多工程为了省事只对状态机复位,不对数据寄存器复位,结果上电后寄存器内容是X。之后软件一旦没写就直接读,仿真波形上一片红,接口对不上,排查很多时间。我的建议是全部寄存器都有明确的复位值,哪怕只是0。对只读的状态寄存器,复位值还建议设成有意义的状态初值,软件启动后第一时间就能读到硬件状态。

5.4 实测调试中的几个高频问题速查表

现象可能原因排查方式
主设备写事务卡住,BVALID一直不来从机aw_done或w_done标志没置起看AWREADY/WREADY是否有握手成功,再逐级查标志位
写成功后寄存器值不对,高位被改WSTRB没过滤,整字写入检查WSTRB字节使能逻辑是否逐字节判断
读回数据和写入值不一致读地址译码选错寄存器,或ARADDR未正确锁存仿真中对比ARADDR和ar_addr锁存值,重点看低位
仿真中寄存器打X寄存器未初始化和未复位给所有寄存器补复位值,检查异步复位连接
主机访问保留地址返回全0或未知地址译码default分支未处理统一在default分支返回0,禁止X态
互联网络报SLVERR从机BRESP/RRESP被置为错误值或地址越界检查从机在非法地址处的响应逻辑

还有一个被很多人忽略的调试技巧:拿到ILA或chipscope波形后,不要先看数据,先看握手信号。AXI总线的问题90%出在握手节奏上,只要握手信号符合协议,数据通路上的问题通常立刻就能缩小范围。我的习惯是把AWVALID、WVALID、BVALID、ARVALID、RVALID这几个关键握手信号的跳变沿打上标记,再逐段核对通道时序是否符合预期。

6. 越用越顺手的几个扩展思路

AXI_LITE从机写顺之后,你会发现它的结构几乎是固定的,改改地址映射、换换寄存器堆内容,一个新外设IP就出来了。这个固定套路反而成了最大的优势,设计时间被大幅压缩,代码质量也在一次次复用中变得稳定。

一个小技巧:把寄存器堆单独封装成模块,AXI从机只负责协议侧的逻辑。这样调试时能严格区分问题来源,是协议层出错还是寄存器逻辑出错,一眼就能判断。新项目里换寄存器堆不需要动从机代码,从机侧出bug也不影响寄存器语义。

如果要从AXI_LITE从机往更复杂的方向扩展,我建议按这个顺序走:先支持窄位写保护,再支持多个从机地址区域的组合,然后考虑读写通道的独立时钟域。每一步都建立在对当前这版代码完全理解的基础上,链路会清晰很多。

说回开头那个问题,为什么我始终推荐初学者从AXI_LITE开始接触AMBA总线族?因为你不需要一开始就理解突发、乱序、缓存一致性这些概念,先把握手协议、通道时序、复位约束这些底层的东西吃透,之后无论是学AXI完整版还是理解互联网络,都有了坚实的底座。我见过太多人一上来就啃完整AXI规范,结果被各种交易模式绕晕,最后连最基本的握手协议都没搞明白。AXI_LITE就是那个把复杂世界简化成一张清晰地图的起点。

需要专业的网站建设服务?

联系我们获取免费的网站建设咨询和方案报价,让我们帮助您实现业务目标

立即咨询