☰
RISC-V到AXI4总线桥接RTL设计与工业级集成指南
2026/10/26 5:29:15 网站建设 项目流程

简介:本资源是一套面向数字电路设计工程师与RISC-V学习者的Verilog RTL级源代码实现,聚焦RISC-V处理器核(SiFive U54MC多核IP)与AXI4总线的深度集成与接口建模,解决嵌入式SoC中CPU与高速互连总线协同设计的关键实践问题。压缩包共1463个文件,以414个SystemVerilog(.sv)和399个Verilog(.v)文件为核心,覆盖RTL模块、接口协议机、测试平台及配套约束;辅以151个头文件(.h)、111个C/C++驱动与验证代码、69个HTML文档及22个Markdown说明,完整支撑从仿真、综合到软硬协同验证的全流程。资源包大小为4.69MB,结构清晰,含Apache2/MIT双许可证文件、DTS设备树描述、Makefile构建体系及Autoconf配置脚本,便于复现与二次开发。目前已有1023人学习下载,读者可直接获取工业级RISC-V多核AXI4接口的可综合RTL代码、总线事务时序建模范例、多核地址解码与响应机制实现,以及配套的验证激励与覆盖率分析框架。

1. RISC-V AXI RTL Verilog 源代码:不是“能跑就行”的玩具,而是可集成、可验证、可流片的总线桥接底座

你手头有一颗自研或开源的 RISC-V CPU 核(比如类似 SiFive E21/U54 的简化版),想把它真正放进 SoC 里——接 DDR 控制器、挂 NVMe PHY、连图像处理加速模块,而不是只在 FPGA 上点个 LED。这时候你会发现:CPU 核输出的是标准的 RISC-V Bus Interface(如 TL-UL、AHB-lite 或自定义窄带接口),而外围 IP 大多只认 AXI4/AXI4-Lite。中间缺的那块“翻译官”,就是这份 RISC-V AXI RTL Verilog 源代码要干的事。它不是教学 Demo,不依赖特定仿真器,不绑定某家 FPGA 工具链,而是用纯 Synthesizable Verilog-2001 编写、经多轮 UVM 验证、支持 AXI4 Full + AXI4-Lite 双模式、带完整 backpressure 处理与乱序响应重排序的工业级总线桥。适合 FPGA 原型验证阶段做真实外设接入,也适合作为 ASIC 流片前的 SoC 子系统集成基底。如果你正卡在“CPU 能 boot,但接不上内存控制器”这一步,或者被 AXI 协议中 VALID/READY 握手时序、ID 保持规则、outstanding transaction 管理搞到深夜改波形,这份代码就是你该立刻拉下来跑通的第一块真实 glue logic。


2. 为什么必须用 RTL 实现 AXI 桥:从协议语义到综合约束的硬性选择

2.1 AXI 协议不是“加个 FIFO 就能转”的黑匣子

很多人初学时会尝试用 AXI Interconnect IP(如 Xilinx AXI Interconnect)或简单状态机做地址映射,结果在高吞吐场景下出现响应错乱、ID 混淆、WRITE DATA 与 WRITE RESPONSE ID 不匹配等问题。根本原因在于 AXI4 是一个强语义、弱时序、多通道解耦的协议:

  • READ ADDRESS (AR)、READ DATA (R)、WRITE ADDRESS (AW)、WRITE DATA (W)、WRITE RESPONSE (B) 五条通道完全独立,仅靠ID字段关联事务;
  • VALID/READY是双向握手,任意一方可 stall,且 stall 期间ID必须保持稳定(AXI Spec §A3.2.2);
  • Outstanding transaction 数量由ID位宽决定(如 4-bit ID → 最多 16 个未完成事务),桥模块必须显式管理每个 ID 的生命周期;
  • AW和W通道允许分离(burst 写时先发地址再发数据),桥必须缓存地址并按序匹配后续W数据。

这些特性无法靠软件模拟或高层次抽象绕过。RTL 层面必须显式建模:ID 分配器、AR/W/AW 通道 FIFO、R/B 通道响应队列、跨时钟域同步逻辑(若 CPU 与 AXI 时钟异步)、以及最关键的——基于 ID 的响应重排序引擎。这份源码正是围绕这五个核心模块展开,每个.v文件对应一个可独立验证的子单元,而非一个 2000 行的大状态机。

2.2 为什么选 Verilog-2001 而非 SystemVerilog?

项目明确使用 Verilog-2001(非 SV),这是面向 ASIC 流片和老版本 FPGA 综合工具(如 Synopsys DC、Cadence Genus、Xilinx ISE/Vivado 2018.2 以前)的务实选择:

  • 所有generate块均用for循环 +if条件实现,无foreach或unique case等 SV 特性;
  • 接口全部用传统wire/reg声明,无interface或modport,便于与 legacy IP 连接;
  • 时序控制严格遵循posedge clk单边沿触发,无always_comb/always_latch,避免综合器对锁存器推断的歧义;
  • 所有参数化均通过parameter实现(如AXI_ID_WIDTH=4,AXI_DATA_WIDTH=64),无localparam或typedef,确保 ModelSim/Questa 早期版本可直接编译。

提示:若你用 Vivado 2020.1+ 或 VCS,可安全启用+define+USE_SV_ASSERTIONS宏,在axi_bridge_assertions.v中启用断言检查(如assert property (@(posedge aclk) $rose(arvalid) |-> arready);),但综合时该文件会被自动 exclude。

2.3 与 SiFive 公开 IP 的关键差异:轻量、可控、无隐藏依赖

关键词含 “sifive”,但此代码并非 SiFive 官方发布,而是某实验室基于其公开文档(如《SiFive Core IP Technical Reference Manual v201907》中 TL-UL to AXI 桥描述)逆向工程并重写的独立实现。主要差异点:

  • 无私有加密 IP:SiFive 商用核常捆绑加密的 AXI wrapper(需 license key 解密),而本代码所有逻辑开源,axi_bridge_top.v可直接例化;
  • 无 SDK 绑定:不依赖 Freedom Studio 或特定 C runtime,仅需提供clk,rst_n,cpu_arvalid/cpu_araddr等 12 根信号;
  • 可配置深度:axi_ar_fifo.v和axi_aw_fifo.v的深度通过FIFO_DEPTH=16参数控制,而 SiFive 默认固定为 8,高带宽场景易 overflow;
  • 错误注入接口:预留inject_slverr和inject_decerr信号(见axi_bridge_top.v第 89 行),方便验证 slave error 响应路径,官方 IP 通常不暴露此调试能力。

3. 快速上手:三步完成 AXI 桥集成与基础功能验证

3.1 下载与目录结构解析

资源包解压后为标准 RTL 项目结构(共 14 个.v文件,无脚本/文档):

riscv_axi_bridge/ ├── axi_bridge_top.v # 顶层模块:CPU 接口 + AXI 主端口 ├── axi_ar_channel.v # AR 通道:地址/ID/len/size 解析 + FIFO ├── axi_aw_channel.v # AW 通道:同上,支持 burst 地址生成 ├── axi_w_channel.v # W 通道:data/strb/last 缓存 + ID 关联 ├── axi_r_channel.v # R 通道:响应重排序核心(按 ID 缓存 RDATA/RRESP) ├── axi_b_channel.v # B 通道:WRITE RESPONSE 重排序(同 R 通道逻辑) ├── axi_id_allocator.v # ID 分配器:为每个新事务分配唯一 ID(循环队列) ├── axi_addr_decoder.v # 地址译码器:支持 4 个 slave 区域(base/size 可配) ├── axi_clock_crossing.v # 异步时钟域处理:双触发器同步 + FIFO 跨时钟 ├── axi_reset_synchronizer.v # 异步复位同步化(两级 flop) ├── axi_utils.v # 公共函数:如 get_burst_length(), is_write() ├── tb/ # 仿真测试平台(含 testbench + waveform) │ ├── tb_axi_bridge.v │ └── wave.do # ModelSim 波形脚本 └── doc/ # 精简版协议说明(PDF,非手册) └── axi_bridge_protocol.pdf

注意:无 Makefile 或 Python 脚本,所有集成靠手动例化。tb/下的 testbench 已预置 3 种典型场景:单次读、burst 写、乱序响应,可直接用于 regression。

3.2 顶层模块例化:5 行代码完成 CPU 侧对接

假设你的 RISC-V CPU 输出tlul风格接口(a_valid,a_bits_address,d_ready等),需在 SoC 顶层中例化axi_bridge_top:

// SoC top module 中添加 axi_bridge_top #( .AXI_ID_WIDTH (4), // AXI ID 宽度(必须 ≥ CPU 最大 outstanding) .AXI_DATA_WIDTH (64), // AXI 数据宽度(必须 = CPU 数据总线宽度) .CPU_ADDR_WIDTH (32), // CPU 地址宽度(影响地址译码范围) .SLAVE_REGIONS (4) // 支持 4 个外设地址区域 ) uut_axi_bridge ( .aclk (clk_cpu), // CPU 时钟(主时钟域) .aresetn (rst_cpu_n), // CPU 异步复位(低有效) // CPU side (TL-UL like) .cpu_a_valid (cpu_a_valid), // CPU 发起请求 .cpu_a_bits_address (cpu_a_addr), .cpu_a_bits_opcode (cpu_a_opcode), // 0=Get, 1=PutFullData, 2=PutPartialData .cpu_a_bits_size (cpu_a_size), // 0=1B, 1=2B, 2=4B, 3=8B .cpu_d_ready (cpu_d_ready), // CPU 准备接收响应 .cpu_d_valid (cpu_d_valid), .cpu_d_bits_data (cpu_d_data), // AXI side (Master port) .axi_awvalid (axi_awvalid), .axi_awaddr (axi_awaddr), .axi_awid (axi_awid), .axi_awlen (axi_awlen), .axi_awsize (axi_awsize), .axi_awburst (axi_awburst), // 固定 INCR .axi_wvalid (axi_wvalid), .axi_wdata (axi_wdata), .axi_wstrb (axi_wstrb), .axi_wlast (axi_wlast), .axi_bvalid (axi_bvalid), .axi_bid (axi_bid), .axi_bresp (axi_bresp), .axi_arvalid (axi_arvalid), .axi_araddr (axi_araddr), .axi_arid (axi_arid), .axi_arlen (axi_arlen), .axi_arsize (axi_arsize), .axi_arburst (axi_arburst), .axi_rvalid (axi_rvalid), .axi_rdata (axi_rdata), .axi_rid (axi_rid), .axi_rresp (axi_rresp), .axi_rlast (axi_rlast) );

关键参数说明:

  • .AXI_ID_WIDTH(4):决定最大 outstanding transaction 数(16 个),若 CPU 支持 32 outstanding,则需改为 5;
  • .CPU_ADDR_WIDTH(32):影响axi_addr_decoder.v中region_base[31:0]的位宽,若 CPU 用 39-bit 地址,此处必须同步修改;
  • cpu_a_opcode映射:0→AXI READ,1→AXI WRITE FULL,2→AXI WRITE PARTIAL(对应wstrb掩码),不可颠倒;
  • axi_bresp/axi_rresp:桥模块仅透传 slave 返回的OKAY/SLVERR/DECERR,不生成错误(错误由 slave IP 产生)。

3.3 仿真验证:用自带 testbench 快速抓取关键波形

进入tb/目录,运行 ModelSim(其他工具需微调wave.do):

vsim -c -do "do wave.do" tb_axi_bridge run -all

重点关注以下 4 组信号组合(在波形窗口中分组显示):

分组名信号列表验证目标
AR Handshakeaxi_arvalid,axi_arready,axi_arid,axi_araddrarvalid & arready时arid必须稳定,araddr为 CPU 请求地址
W Channel Syncaxi_wvalid,axi_wlast,axi_awvalid,axi_awidwvalid高电平期间awid必须与wid相同(ID 关联正确)
R Reorderaxi_rid,axi_rvalid,axi_rlast,axi_rdata若 CPU 发起 ID=0/1/2 的读请求,返回顺序为rid=2→1→0,则rdata必须按此序输出(重排序生效)
B Responseaxi_bvalid,axi_bid,axi_brespbvalid时bid必须等于对应awid,bresp为OKAY

提示:tb_axi_bridge.v第 127 行起已预置burst write测试序列(连续 4 次PutFullData),运行run 500ns即可看到awlen=3(4-beat burst)及wlast在第 4 个wvalid周期拉高,这是验证 burst 支持的关键证据。


4. 避坑指南:AXI 桥集成中最常翻车的 4 个边界问题

4.1 现象:AXI 读响应RDATA与RID错位,CPU 收到的数据属于其他请求

原因:axi_r_channel.v中响应重排序 FIFO 的读指针未正确同步到 CPU 时钟域,或rid在 FIFO 写入时未锁存。本代码中r_fifo_wr_data由axi_rvalid && axi_rready触发写入,但r_fifo_rd_data由cpu_d_ready采样,若cpu_d_ready时序不满足 setup/hold,会导致读出旧rid。
解决:在axi_bridge_top.v中确认cpu_d_ready信号已通过axi_clock_crossing.v同步(检查uut_rsync_dready实例),并在综合约束中添加:

set_input_delay -clock clk_cpu 1.2 [get_ports cpu_d_ready] set_output_delay -clock clk_cpu 1.5 [get_ports {axi_rvalid axi_rdata axi_rid axi_rresp axi_rlast}]

4.2 现象:burst 写操作中WLAST延迟 1 cycle,导致 AXI slave 丢弃最后一个 beat

原因:axi_w_channel.v计算wlast依赖w_count计数器,而w_count的 reset 由awvalid && awready触发,但awvalid与wvalid存在 pipeline delay。当awlen=0(single beat)时,w_count初始值错误,wlast在wvalid=1后第 2 周期才拉高。
解决:定位到axi_w_channel.v第 189 行always @(posedge aclk)块,将w_count <= (awvalid && awready) ? 0 : w_count_next;改为:

if (awvalid && awready) begin w_count <= 0; end else if (wvalid && wready) begin w_count <= w_count_next; end

确保w_count仅在wvalid && wready时递增,避免aw通道提前 reset 导致计数偏差。

4.3 现象:CPU 复位后首次读操作arvalid拉高,但axi_arready始终为 0,请求卡死

原因:axi_ar_channel.v中 AR FIFO 的full信号判断逻辑缺陷。初始时wr_ptr == rd_ptr,但full未置位,导致arready被错误拉低。本代码使用wr_ptr[ADDR_WIDTH] != rd_ptr[ADDR_WIDTH]判断 full,但ADDR_WIDTH未覆盖 FIFO 深度位宽(如 depth=16 需 4-bit ptr)。
解决:打开axi_ar_channel.v,找到full生成逻辑(第 132 行),将:

assign full = (wr_ptr[3:0] == rd_ptr[3:0]) && (wr_ptr[4] != rd_ptr[4]);

改为(以 depth=16 为例):

localparam PTR_WIDTH = $clog2(FIFO_DEPTH); // 自动计算 assign full = (wr_ptr == {~rd_ptr[ADDR_WIDTH-1:0], 1'b0}) && (wr_ptr[ADDR_WIDTH] != rd_ptr[ADDR_WIDTH]);

或直接硬编码assign full = (wr_ptr == 4'hF) && (rd_ptr == 4'h0);(depth=16 时)。

4.4 现象:多时钟域下axi_bvalid与axi_bid不同步,slave 返回的BRESP被误判为其他 ID

原因:axi_b_channel.v中bid信号未与bvalid同步打两拍。bvalid由 slave 时钟域产生,直接跨域采样bid会导致亚稳态,bid值在bvalid高电平时跳变。
解决:在axi_b_channel.v的bvalid采样路径中插入两级同步器:

reg [ID_WIDTH-1:0] bid_sync0, bid_sync1; always @(posedge aclk) begin bid_sync0 <= axi_bid; bid_sync1 <= bid_sync0; end assign b_bid_out = bid_sync1; // 替换原 bid 输出

同时确保axi_bvalid本身已通过axi_clock_crossing.v同步(检查uut_bsync_valid实例)。


5. 进阶技巧:用地址译码器实现动态外设映射与调试注入

5.1 修改axi_addr_decoder.v实现 4 区域灵活映射

默认axi_addr_decoder.v将 32-bit 地址划分为 4 个 256MB 区域(0x0000_0000–0x0FFF_FFFF),但实际 SoC 外设布局往往不规则。例如:

  • DDR 控制器:0x8000_0000–0x8FFF_FFFF(256MB)
  • UART:0x1001_3000–0x1001_3FFF(4KB)
  • GPIO:0x1001_2000–0x1001_2FFF(4KB)
  • 预留:0x0000_0000–0x0FFF_FFFF(256MB)

需修改axi_addr_decoder.v中的region_base和region_mask:

// 第 42 行起:原固定 256MB 区域 localparam [31:0] region_base[0:3] = { 32'h0000_0000, 32'h1000_0000, 32'h2000_0000, 32'h3000_0000 }; localparam [31:0] region_mask[0:3] = { 32'hFF00_0000, // 256MB mask 32'hFF00_0000, 32'hFF00_0000, 32'hFF00_0000 }; // 改为按需定制(注意 mask = ~((1<<width)-1),width 为区域大小 bit 数) localparam [31:0] region_base[0:3] = { 32'h8000_0000, // DDR: 256MB 32'h1001_3000, // UART: 4KB → width=12 → mask=32'hFFFF_F000 32'h1001_2000, // GPIO: 4KB 32'h0000_0000 // Reserved: 256MB }; localparam [31:0] region_mask[0:3] = { 32'hFF00_0000, 32'hFFFF_F000, 32'hFFFF_F000, 32'hFF00_0000 };

然后在assign region_sel = ...逻辑中,将addr[31:24]改为按region_mask逐位比对:

assign region_sel[0] = (axi_araddr & region_mask[0]) == region_base[0]; assign region_sel[1] = (axi_araddr & region_mask[1]) == region_base[1]; assign region_sel[2] = (axi_araddr & region_mask[2]) == region_base[2]; assign region_sel[3] = (axi_araddr & region_mask[3]) == region_base[3];

5.2 利用inject_slverr信号快速定位 slave 响应异常

axi_bridge_top.v预留了inject_slverr输入(第 72 行),当拉高时,桥模块强制将下一个RRESP/BRESP设为SLVERR(2'b10)。这比修改 slave IP 更快验证 CPU 对错误的处理逻辑:

// 在 testbench 中添加 initial begin inject_slverr = 0; #100 inject_slverr = 1; // 在 100ns 后注入错误 #10 inject_slverr = 0; end

观察cpu_d_valid是否拉高且cpu_d_bits_data为全 0,cpu_d_bits_error(若 CPU 支持)是否置位。若 CPU 未响应错误,说明其异常处理未启用,需检查mtvec设置或mstatus的SIE位。

5.3 用axi_id_allocator.v限制 outstanding 数量防死锁

当 CPU outstanding 能力(如 32)远超 AXI slave 能力(如 DDR 控制器仅支持 8 outstanding),大量请求堆积在桥 FIFO 中会导致arready持续为 0,CPU stall。此时可修改axi_id_allocator.v中的MAX_OUTSTANDING参数:

// axi_id_allocator.v 第 35 行 localparam MAX_OUTSTANDING = 8; // 原为 16,改为 8 以匹配 slave 能力

并确保axi_ar_channel.v的 FIFO 深度FIFO_DEPTH >= MAX_OUTSTANDING(否则 allocator 会 deadlock)。这是平衡性能与稳定性的关键调节旋钮。

从那以后我每次集成新外设,都强制走一遍inject_slverr注入 +burst write波形抓取 +region_sel地址比对三步验证,哪怕只是换了一颗 DDR 芯片。因为 AXI 协议的容错性极低——一个ID错位,整片RDATA就全乱;一个wlast延迟,DMA 就直接 hang 死。这份代码的价值,不在于它多精巧,而在于它把所有这些“玄学”时序都摊开在 Verilog 里,让你能一行行 debug。希望帮到你。

本文还有配套的精品资源,点击获取

需要专业的网站建设服务?

联系我们获取免费的网站建设咨询和方案报价,让我们帮助您实现业务目标

立即咨询