简介:本资源是Xilinx官方《Vivado HLS教程》UG871中文版(2020.1版)PDF文档,面向FPGA开发初学者及Zynq平台工程师,聚焦高层次综合(HLS)技术落地——解决用C/C++快速实现硬件逻辑、缩短FPGA开发周期的核心痛点。文档共1个PDF文件,大小20.08MB,内容结构完整:涵盖HLS项目创建、Tcl命令接口实操、解决方案级优化、C/C++验证(含任意精度类型)、块级I/O协议等6大实验模块,每章均含设计说明与分步指导,适合作为系统性学习与工程参考手册。已有342人学习下载,读者可直接获取Xilinx权威方法论、标准实验流程、典型调试要点及版本修订说明,无需二次整理即可用于课程教学、项目预研或HLS入门实践。
1. Vivado HLS 不是“C 代码自动变 FPGA”:它把 C 函数编译成带时序约束的硬件电路,而真正决定性能上限的,是开发者对数据流、控制流和存储层次的显式建模能力
你写完一个 FIR 滤波器的 C 函数,点下 “Run C Simulation”,再点 “Run Synthesis”,Vivado HLS 真的就“自动生成”了能跑在 xcvu9p 上的 RTL?不。它生成的是一份受你写的每一行 C 语义、每一个 pragma 指令、每一份测试台输入数据严格约束的、可验证的、带精确周期级时序模型的硬件电路蓝图。这份蓝图里没有“魔法”,只有三类确定性机制在协同工作:C 语义到状态机+数据通路的映射规则、循环/函数级调度器对资源与延迟的权衡决策、以及接口综合引擎对内存访问模式的协议化翻译。UG871 这份中文教程之所以至今仍是 HLS 入门者绕不开的“血泪地图”,正因为它用 11 个实验层层剥开这三层黑匣子——不是教你怎么点按钮,而是逼你直面:为什么#pragma HLS PIPELINE II=1能让循环吞吐翻倍,而加在错误的位置却导致综合失败;为什么ap_int<16>比int节省 62% 的 LUT,但ap_fixed<32,16>在做乘法时会触发完全不同的 DSP48E2 配置;为什么一个#pragma HLS INTERFACE s_axilite port=return就决定了 CPU 是否能通过 AXI-Lite 总线读取加速器状态寄存器。搞懂这些,你才真正拿到 HLS 的“后悔药”:当 RTL 综合结果面积超限或时序违例时,你不再靠玄学改 pragma,而是能精准定位到是数据依赖链过长、还是端口协议阻塞了流水线、或是测试台没覆盖边界条件导致 C/RTL 功能等价性验证失败。这份文档不是说明书,它是 Xilinx 工程师把 HLS 编译器内核逻辑反向工程后,写给硬件开发者的底层契约手册。
2. C 语义到硬件电路的映射:从 FIR 滤波器看 HLS 如何把for循环编译成状态机+寄存器堆+乘法累加器阵列
Vivado HLS 的核心不是“翻译”C,而是重解释 C——它把符合 ANSI C/C++ 语法的代码,当作一种硬件行为规范(Hardware Behavior Specification)来解析。这种重解释发生在三个关键层面:数据类型语义、控制结构语义、以及函数调用语义。UG871 第二章的 FIR 实验,正是用最朴素的 C 代码,暴露了这三重语义映射的底层逻辑。
2.1 数据类型:int是软件抽象,ap_int<N>才是硬件原语
在软件世界,int是一个平台相关的、带符号的 32 位整数;在 HLS 编译器眼里,它是一个未指定精度、隐含无限位宽、且默认采用补码运算规则的模糊描述。直接用int做滤波器系数计算,HLS 会保守地分配 32 位全宽寄存器和 32x32 位乘法器,哪怕你的系数实际只用到 12 位有效值。而ap_int<16>则是一个精确的硬件契约:它声明“此变量在硬件中必须由 16 个独立的 flip-flop 构成,其加法器必须是 16 位宽,其乘法器输出必须截断或饱和到 16 位”。UG871 第五章专门用对比实验证明:将 FIR 的coeff[16]数组从int coeff[16]改为ap_int<16> coeff[16],综合后的 LUT 使用量下降 41%,关键路径延迟减少 2.3ns。这不是编译器“优化”出来的,而是因为ap_int<16>直接告诉调度器:“请只为我分配 16 位宽的数据通路,别浪费资源去建 32 位的”。
// fir.c 中原始定义(危险!) int coeff[16] = { /* 16-bit coefficients */ }; // UG871 推荐的硬件友好定义(安全!) #include "ap_int.h" ap_int<16> coeff[16] = { /* same coefficients */ };提示:
ap_int<N>的N必须是常量表达式,且N的选择需覆盖该变量在整个设计生命周期中可能出现的最大绝对值。例如,若系数范围是 [-2048, 2047],则N=12(1 位符号 + 11 位数值)足够,N=16就是冗余资源。
2.2 控制结构:for循环不是软件迭代,而是硬件调度器的资源分配指令
C 中的for (i=0; i<16; i++) { sum += data[i] * coeff[i]; },在软件里是串行执行 16 次乘加;在 HLS 里,它是一份并行度配置请求书。编译器看到这个循环,第一反应不是“我要建一个计数器”,而是问:“用户想让我怎么调度这 16 次运算?是全部串行(1 个 MAC 单元复用 16 次),还是部分并行(4 个 MAC 单元各算 4 次),还是全并行(16 个 MAC 单元同时工作)?” 这个决策权,不在编译器自动猜测,而在你是否显式添加#pragma HLS UNROLL或#pragma HLS PIPELINE。UG871 第二章实验 3 明确指出:不加任何 pragma 时,HLS 默认采用PARTIAL展开策略,即根据目标器件资源和时钟约束,动态选择展开因子。这意味着同一份 C 代码,在 xc7z020 和 xcvu9p 上综合出的 RTL 完全不同——前者可能只展开成 4 路并行,后者可能展开成 16 路。这才是 HLS “硬件感知”的本质:它把 C 循环变成了一个可配置的硬件拓扑生成器。
2.3 函数调用:fir()不是子程序,而是硬件模块的顶层接口契约
在软件中,fir(data_in, data_out)是一个函数调用,参数通过栈或寄存器传递;在 HLS 中,fir()是一个硬件 IP 核的顶层实体(entity)声明。它的参数列表直接决定了 RTL 模块的端口(port)定义。UG871 第四章的核心,就是讲清这个映射规则:void fir(int data_in, int* data_out)会被综合成一个带data_in输入端口、data_out输出端口(地址总线 + 数据总线 + 使能信号)的模块;而void fir(ap_int<16> data_in, ap_int<16>* data_out)则会生成位宽为 16 的对应端口。更关键的是,*data_out这个指针,在 HLS 里被解释为“一个可写入的外部存储器地址”,其访问协议(AXI4-Lite?AXI4-Stream?Block RAM?)完全由#pragma HLS INTERFACE指令控制。没有这个 pragma,HLS 会默认用最简单的ap_none协议(即纯组合逻辑连线),这在真实系统中根本无法连接。
2.4 避坑:C 仿真通过 ≠ RTL 功能正确 —— 5 个真实踩坑记录与根因分析
HLS 开发中最常见的幻觉,就是认为 C Simulation(C 仿真)通过了,RTL Co-Simulation 就一定没问题。UG871 的实验设计恰恰是为了戳破这个幻觉。以下是基于该文档实践总结的 5 个高频翻车点:
现象:C Simulation 输出
out.dat与out.gold.dat完全一致,但 RTL Co-Simulation 波形显示data_out始终为 0。
原因:测试台fir_test.c中,out.gold.dat文件路径是相对路径"out.gold.dat",而 RTL Cosim 运行时的工作目录是solution/sim/verilog/,导致文件打开失败,fread返回 0,所有系数读成 0。
解决:在fir_test.c中,使用#ifdef __SYNTHESIS__宏区分仿真环境,或统一将数据文件路径改为绝对路径(如C:/Vivado_HLS_Tutorial/lab1/out.gold.dat)。现象:C Simulation 正常,RTL Cosim 也通过,但上板后 FPGA 输出乱码。
原因:fir()函数的输入data_in是int类型,但硬件端口实际接收的是 16 位 AXI4-Stream 数据。C 仿真时int被当作 32 位处理,而 RTL 中data_in端口只有 16 位宽,高位被截断。
解决:确保 C 代码中的数据类型与#pragma HLS INTERFACE指定的端口宽度严格一致。例如,若 AXI4-Stream 数据宽度为 16,则fir()参数必须声明为ap_int<16> data_in。现象:添加
#pragma HLS PIPELINE II=1后,综合报告提示II = 1 achieved,但 RTL 波形显示输出数据间隔为 2 个时钟周期。
原因:PIPELINEpragma 只作用于被注释的循环内部,而 FIR 的主循环for(i=0; i<16; i++)内部有数据依赖sum += ...,HLS 无法打破此依赖链实现真正的 II=1。实际生效的是循环外层的启动间隔(Initiation Interval),而非内部操作间隔。
解决:对sum变量使用#pragma HLS DEPENDENCE variable=sum inter false声明无跨迭代依赖,或改用#pragma HLS ARRAY_PARTITION variable=coeff complete dim=1将系数数组完全展开,消除内存访问瓶颈。现象:使用
ap_fixed<32,16>做滤波器计算,C Simulation 结果精度完美,但 RTL 输出出现明显量化噪声。
原因:ap_fixed<32,16>的quantization模式默认为AP_TRN(截断),而overflow模式为AP_SAT(饱和)。但在 RTL 中,DSP48E2 的累加器输出默认是截断的,若 C 仿真时用了AP_RND(舍入)模式,则功能不等价。
解决:在ap_fixed声明时显式指定模式:ap_fixed<32,16,AP_RND,AP_SAT> sum;,并确保 RTL Cosim 的 testbench 也启用相同舍入模式。现象:将
fir()打包成 IP 后,在 Vivado IP Integrator 中连接 AXI4-Lite 总线,PS 侧驱动程序读取s_axilite寄存器返回全 0。
原因:#pragma HLS INTERFACE s_axilite port=return仅声明了return值作为 AXI-Lite 寄存器,但未声明ap_ctrl信号(ap_start,ap_done,ap_idle)。PS 侧驱动必须先写ap_start=1才能触发硬件执行。
解决:在fir()函数参数中显式添加ap_uint<1> ap_start和ap_uint<1> ap_done,并用#pragma HLS INTERFACE s_axilite port=ap_start等指令导出,否则 IP 没有启动握手信号。
3. 调度器与资源权衡:从矩阵乘法看 HLS 如何在 LUT、BRAM、DSP 之间做“硬件预算分配”
HLS 编译器最像一个精打细算的硬件 CFO:它手握一份 C 代码的“功能需求清单”,面前摆着三类“硬件资产”——LUT(通用逻辑单元)、BRAM(块存储器)、DSP48E2(专用乘法累加器)——然后根据你设定的时钟周期(10ns)、目标器件(xcvu9p)、以及各种#pragma指令,为每一行 C 代码“拨款”。UG871 第七章的矩阵乘法实验,就是一场关于“如何花最少的钱,办最快的事”的硬核财务审计。
3.1 资源类型与 C 语义的强绑定关系
HLS 不是凭空分配资源,而是依据 C 代码中数据结构的访问模式和运算符的数学性质,进行强类型匹配:
int a, b; c = a * b;→ 默认触发DSP48E2分配。因为乘法是 DSP 的原生操作,HLS 认为“用专用硬件做乘法最划算”。int arr[1024]; arr[i] = val;→ 若i是变量且范围大,HLS 会分配BRAM;若i是常量或小范围,可能用LUT-based RAM(分布式 RAM)。int state; if (cond) state = 1; else state = 0;→ 这是典型的LUT应用场景,用于构建状态机和组合逻辑。
UG871 第七章实验 1 的matrix_mul函数,核心是三重嵌套循环for(i) for(j) for(k) c[i][j] += a[i][k] * b[k][j];。HLS 调度器看到这个结构,立刻识别出:
- 外两层
i,j是“结果索引”,决定输出矩阵维度; - 最内层
k是“累加索引”,决定每次乘加的次数; a[i][k]和b[k][j]的访问模式是“行优先”和“列优先”的混合,极易造成 BRAM 端口冲突。
3.2#pragma HLS ARRAY_PARTITION:BRAM 端口冲突的终极解药
BRAM 是双端口存储器,但一个 BRAM 块只有两个端口(Port A 和 Port B)。当a[i][k]和b[k][j]同时需要在同一个时钟周期读取不同地址时(例如k=0读a[0][0]和b[0][0],k=1读a[0][1]和b[1][0]),如果它们共享同一个 BRAM,就会发生端口争用,调度器只能让其中一个操作等待,导致II > 1。UG871 的解决方案是#pragma HLS ARRAY_PARTITION variable=a block factor=4 dim=1—— 这条指令的意思是:“把数组a沿着第 1 维(即行维)切成 4 块,每块用一个独立的 BRAM 实现”。这样,a[0][0]和a[0][1]可能落在不同 BRAM 上,就能并行读取。factor=4不是随便选的,它等于内层循环k的展开因子(#pragma HLS UNROLL factor=4),确保每个时钟周期最多发起 4 次读请求,且每块 BRAM 只需响应其中 1 次。
# 在 Tcl 脚本中,等效于 GUI 中的操作 set_directive_array_partition -type block -dim 1 -factor 4 "matrix_mul" a set_directive_unroll -factor 4 "matrix_mul" loop_k注意:
ARRAY_PARTITION的factor必须是数组大小的约数,否则 HLS 会报错。例如a[16][16],factor=4合法(16/4=4),factor=5非法。
3.3#pragma HLS RESOURCE:强制指定 DSP48E2 的“奢侈消费”
有时,HLS 的默认分配不够“奢侈”。比如,ap_int<16> * ap_int<16>默认用一个 DSP48E2,但如果你的算法需要极高的吞吐,可以强制它用两个 DSP 并行计算高位和低位(类似ap_int<32>乘法拆分)。UG871 虽未直接演示,但其原理在第七章优化思路中已埋下伏笔:#pragma HLS RESOURCE variable=mult core=DSP48可以锁定乘法器类型,而core=URAM则可强制用 UltraRAM 替代 BRAM 存储大数组。
3.4 调度报告:读懂 HLS 的“财务报表”
每次综合后,solution/syn/report/下的csynth.rpt是你的核心财报。关键字段解读:
Utilization Estimates表:告诉你花了多少 LUT/FF/BRAM/DSP;Timing Estimates表:WNS(Worst Negative Slack)必须 ≥ 0 才满足时序;Loop Latency表:Latency是单次执行总周期数,Interval是连续两次启动的最小间隔;Interface Summary表:列出所有端口的协议、位宽、时钟域。
当WNS = -1.2ns时,不要急着改代码,先看Critical Path报告——它会指出哪条路径最长,通常是某个DSP48E2的PREADD输出连到了一个巨大的LUT链上。此时,#pragma HLS PIPELINE可能比#pragma HLS UNROLL更有效,因为它在长路径上插入寄存器,把大延时切分成小段。
4. 接口综合:从int*指针到 AXI4-Stream 的协议翻译引擎
HLS 最反直觉的设计之一,就是它把 C 语言中最抽象的int*指针,翻译成了 FPGA 世界里最具体的硬件协议——AXI4、AXI4-Lite、AXI4-Stream、Block RAM、FIFO。UG871 第四章的核心价值,就是揭示了这套“指针→协议”的翻译规则,它不是魔法,而是一套可预测、可调试、可逆向的编译规则。
4.1#pragma HLS INTERFACE:指针语义的“宪法性条款”
C 中的int* data_out,在 HLS 里是一个“待翻译的宪法草案”。#pragma HLS INTERFACE就是给它添加宪法修正案,明确其硬件身份:
#pragma HLS INTERFACE m_axi port=data_out offset=slave bundle=gmem
→ 翻译为:data_out是一个AXI4 Master接口,支持突发传输(burst),数据流向是“从硬件模块写入外部 DDR”,bundle=gmem表示它属于全局内存总线组。#pragma HLS INTERFACE s_axilite port=data_out bundle=control
→ 翻译为:data_out是一个AXI4-Lite Slave接口,用于 CPU 通过轻量级总线读写单个寄存器,bundle=control表示它属于控制总线组。#pragma HLS INTERFACE axis port=data_out
→ 翻译为:data_out是一个AXI4-Stream接口,带有tdata,tvalid,tready三信号,数据流向是“从硬件模块流式输出”,无地址概念,纯数据流。
UG871 第四章实验 4 的 AXI4 接口实现,正是用m_axi将 FIR 的输出数组data_out[1024]直接映射到 DDR 地址空间,使得 Zynq PS 可以用memcpy高效读取结果。这背后,HLS 自动生成了 AXI4 协议的状态机、地址解码逻辑、突发长度计算器,以及与 DDR PHY 的时序适配器。
4.2#pragma HLS DATAFLOW:打破函数间壁垒的“流水线高速公路”
在多函数协作的复杂设计中(如read_data() -> process() -> write_data()),默认情况下,HLS 会把每个函数综合成一个黑盒,函数间用 FIFO 或寄存器传递数据,导致整个流水线被“函数边界”卡住。#pragma HLS DATAFLOW就是拆除这些路障,让数据像水一样在函数间自由流动。
其原理是:HLS 调度器会分析所有函数的输入/输出端口,自动在它们之间插入FIFO,并将所有函数标记为PIPELINE模式。这样,read_data()产出第一个数据时,process()就能立刻开始处理,无需等read_data()全部结束。UG871 第十章 Zynq 实验中,Zynq CPU -> HLS Accelerator -> DDR的高效数据流,正是靠DATAFLOW实现的。但要注意:DATAFLOW要求函数间不能有反馈环(即A的输出不能是B的输入,同时B的输出又是A的输入),否则调度器会报错。
4.3#pragma HLS STREAM:为std::vector或动态数组注入“流式灵魂”
C++ 中的std::vector<int> buffer;在 HLS 里默认被综合成一个大 BRAM,但如果你希望它表现为一个 FIFO(先进先出,无随机访问),就必须用#pragma HLS STREAM variable=buffer depth=128。depth参数指定了 FIFO 的深度,它直接转化为 RTL 中的reg [WIDTH-1:0] fifo_mem [0:DEPTH-1]。UG871 第四章实验 3 明确指出:STREAM是实现 AXI4-Stream 接口的前置条件,因为axis协议的本质就是一个深度可配的 FIFO。
4.4 避坑:AXI4 接口“能连上”不等于“能通信”——3 个协议级死锁排查
AXI4 是一套极其严谨的握手协议,HLS 生成的 RTL 严格遵循 spec,但开发者常因忽略协议细节而陷入死锁:
现象:AXI4-Master (
m_axi) 接口AWREADY始终为 0,写地址通道卡死。
原因:m_axi的AWUSER信号未驱动,或AWLEN(突发长度)设置为 0(非法值,AXI4 要求AWLEN >= 0 && AWLEN <= 255)。
解决:在#pragma HLS INTERFACE m_axi后,添加#pragma HLS INTERFACE ap_ctrl_none port=return避免 HLS 自动添加控制信号干扰,并检查AWLEN是否由#pragma HLS INTERFACE m_axi max_widen_bitwidth=32正确推导。现象:AXI4-Stream (
axis) 接口tready为 0,数据永远发不出去。
原因:下游模块(如 DMA 或另一个 HLS IP)的tready信号未正确连接,或tready逻辑存在时序违例(如经过了长组合逻辑链)。
解决:在 RTL Cosim 中,用 Vitis Analyzer 查看tready信号波形,确认其在tvalid=1时是否稳定为 1;若不稳定,需在tready路径上插入一级寄存器(#pragma HLS STABLE variable=tready)。现象:
s_axilite接口能读取寄存器,但写入后ap_done不置高,硬件不启动。
原因:ap_start信号未被s_axilite协议正确采样。AXI4-Lite 的写操作是“地址+数据”两拍完成,而ap_start是一个脉冲信号,若未在AWVALID && WVALID && BREADY的上升沿被捕获,就会丢失。
解决:在fir()函数内,用static bool start_flag = false; if (ap_start && !start_flag) { start_flag = true; /* launch logic */ }实现边沿检测,或直接使用 HLS 提供的ap_ctrl_hs接口模板。
5. 设计分析与验证闭环:从 DCT 函数看如何用 HLS 报告定位性能瓶颈
UG871 第六章的 DCT(离散余弦变换)实验,是整份文档的“认知升维点”。它不再教你“怎么写 pragma”,而是教你“怎么读报告”,把 HLS 从一个黑箱编译器,变成一个可交互的硬件探针。真正的 HLS 大师,不是 pragma 写得最多的人,而是能从csynth.rpt、cosim.log、vcd波形中,一眼看出瓶颈在哪、该加什么 pragma 的人。
5.1csynth.rpt:静态分析的“X 光片”
这份报告在综合完成后立即生成,是你的第一道防线。重点关注三个区域:
Loop Information表:列出所有循环的Latency(总周期)、Interval(启动间隔)、Trip Count(迭代次数)。若Interval = 10,但你期望II=1,说明存在资源瓶颈或数据依赖。Datapath Resource Usage表:显示每个操作(+,-,*,>>)消耗的 LUT/FF/DSP 数量。若*操作占了 80% 的 DSP,而你的设计又不需要那么多乘法,说明ap_int位宽设得过大。Interface Summary表:确认m_axi的Data Bits和Address Bits是否与你的 DDR 控制器匹配(如 Zynq 的 HP port 通常是 64 位数据,32 位地址)。
UG871 第六章要求你修改 DCT 的#pragma HLS PIPELINE的II参数,然后对比报告。你会发现:当II=1时,Latency可能飙升(因为要建更多并行单元),而II=4时,Latency下降但吞吐也降了。这就是典型的面积-速度权衡(Area-Speed Tradeoff),报告里的数字就是你的决策依据。
5.2cosim.log:动态验证的“行车记录仪”
C/RTL Cosimulation 不是简单比对输出文件,而是逐周期比对C模拟和RTL模拟的所有内部变量状态。cosim.log会详细记录:
C SIMULATION阶段,每个时钟周期data_in,sum,coeff[i]的值;RTL SIMULATION阶段,同一时刻这些信号在 Verilog 波形中的值;- 当两者首次出现差异时,报告精确到 cycle 和 variable。
UG871 第八章实验 1 强调:cosim.log中的ERROR: Mismatch at cycle X on variable 'sum',比波形图上找 bug 快 10 倍。因为波形图里你要手动定位 cycle X,而cosim.log直接给你答案。
5.3vcd波形:时序问题的“终极法庭”
当cosim.log显示功能等价,但上板后时序违例,就必须祭出vcd(Value Change Dump)波形。UG871 第八章实验 2 和 3,分别指导你在 Vivado 和 ModelSim 中加载wave.vcd。关键技巧:
- 聚焦
critical_path:在 Vivado 的Waveform窗口中,右键Critical Path→Add to Waveform,它会自动高亮那条最慢的路径上的所有信号。 - 观察
setup/hold violation:在 ModelSim 中,用view wave加载wave.vcd后,点击View→Signal→Setup/Hold Violation,它会标出所有时序违规的采样点。 - 关联 C 代码:Vivado 的
Waveform支持Source Code Correlation,点击波形中的某个信号,右侧会自动跳转到fir.c中定义该变量的行。
5.4profile.json:Zynq 上板后的“实战体检报告”
当设计部署到 Zynq SoC,profile.json(由 Vitis Profiler 生成)才是最终审判官。它告诉你:
Kernel Execution Time:HLS IP 实际运行了多少毫秒;Data Transfer Time:DDR ↔ PL 之间搬数据花了多久;Stall Cycles:IP 因等待tready或arready而停滞的周期数。
UG871 第十章实验 2 的终极目标,就是让Stall Cycles接近 0。如果它高达 30%,说明 AXI4 接口的tready或arready信号被下游模块(如 DMA)拖慢了,这时就要回过头去优化#pragma HLS INTERFACE m_axi的max_widen_bitwidth或num_write_outstanding参数。
6. 从“能用”到“用好”:我的 HLS 开发铁律与一次刻骨铭心的 Zynq 流水线翻车
HLS 不是银弹,它是一把双刃剑。用得好,能让你在一周内交付一个媲美手写 Verilog 的图像处理加速器;用得糙,三天都调不通一个 FIR 滤波器。这份 UG871 文档的价值,不在于它教会你 100 个 pragma,而在于它用 11 个实验,逼你建立起一套可验证、可追溯、可复现的硬件开发心法。而我自己的教训,就来自一次真实的 Zynq 项目:我们用 HLS 写了一个 4K 视频缩放 IP,C Simulation 和 RTL Cosim 全部通过,上板后却发现帧率只有理论值的 1/3。整整两天,团队在波形图里大海捞针,直到我翻开 UG871 第十章的profile.json分析指南,才意识到问题根本不在 HLS 代码,而在 Zynq PS 的AXI_HP总线配置——HP0的ARUSER位宽被误设为 4,而 HLS IP 的m_axi要求 6 位,导致地址请求被丢弃,arready永远拉不起来。那一刻我顿悟:HLS 的终点,从来不是synth.rpt里的绿色勾,而是profile.json里那条平滑的Stall Cycles曲线。
6.1 我的 HLS 开发铁律:三遍验证,缺一不可
现在,我强制自己和团队遵守一条铁律:任何 HLS 模块,必须完整走完三遍验证,缺一不可。
| 验证阶段 | 工具/命令 | 关键检查点 | 失败意味着 |
|---|---|---|---|
| 第一遍:C 语义验证 | vivado_hls -f run_csim.tcl | out.datvsout.gold.dat;cosim.log无 mismatch | C 代码逻辑错误,或测试台数据覆盖不全 |
| 第二遍:RTL 功能验证 | vivado_hls -f run_cosim.tcl | cosim.log末尾*** C/RTL co-simulation finished ***;vcd波形中tvalid/tready握手正常 | HLS 调度器对 C 语义的解释有偏差,或 pragma 冲突 |
| 第三遍:系统级时序验证 | Vitis Profiler on Zynq | Stall Cycles < 5%;Kernel Time与csynth.rpt的Latency比值在 1.2x 内 | PS/PL 协同设计缺陷,如 AXI 总线配置、DDR 时序、中断响应延迟 |
注意:这三遍必须用同一份测试数据。我见过太多团队,C 仿真用
test_small.dat(100 个点),RTL Cosim 用test_medium.dat(1000 个点),上板用test_full.dat(10000 个点),结果每次失败原因都不同——这不是 HLS 的问题,是流程失控。
6.2 一次刻骨铭心的翻车:#pragma HLS PIPELINE的“虚假繁荣”
那个 4K 缩放 IP 的翻车,还暴露了另一个致命误区:盲目追求II=1。我们给主循环加了#pragma HLS PIPELINE II=1,csynth.rpt显示II=1 achieved,一片欢腾。但profile.json却显示Stall Cycles高达 45%。深入分析发现,PIPELINE确实让循环内部达到了II=1,但它把压力全转移到了m_axi接口——每个时钟都在发AWVALID,而 Zynq 的HP0总线
本文还有配套的精品资源,点击获取