☰
APB总线SM4协处理器:硬件加速国密算法的时序设计原理
2026/10/28 20:12:36 网站建设 项目流程

简介:本资源是一份面向数字电路与密码硬件设计初学者及FPGA开发者的Verilog实践项目,聚焦于SM4国密算法在嵌入式总线架构下的协处理器实现。资源提供完整APB总线兼容的SM4加密协处理器RTL设计,涵盖APB从机接口模块、SM4核心算法模块及顶层集成逻辑,支持明文与密钥分四次写入、密文分段读出,代码结构清晰、寄存器定义规范,便于理解总线交互时序与密码模块协同机制。压缩包为单个37KB的docx文档,内含全部Verilog源码(apb_slave、top_level、SM4基本模块)、关键信号说明、地址映射表及SM4轮函数与S盒原理简述,适合作为课程实验参考或IP核二次开发基础。目前已有524人学习下载,可直接用于FPGA综合验证、密码加速模块教学演示或APB外设扩展学习。

1. APB总线上的SM4协处理器:为什么一个“只读一次、写两次就加密”的硬件模块,能绕过CPU瓶颈实现纳秒级加解密?

你有没有遇到过这种玄学时刻:软件调用SM4加密128位数据,耗时3000+ CPU周期,而同一块FPGA板上另一个模块——连调试UART都没接——却在你按下复位键后第7个时钟沿就吐出了密文?这不是魔法,是APB总线把CPU从密码学苦力中解放出来的底层契约。这份Verilog实现的SM4协处理器,表面看只是把国密算法搬进RTL,但它的真正价值在于:用APB协议的确定性时序,把32轮非线性迭代压缩成纯组合+寄存器流水的硬件状态机,让加密不再是“CPU等结果”,而是“总线发完地址,结果已就绪”。它不依赖操作系统调度、不触发中断上下文切换、不占用L1缓存带宽——所有轮密钥生成、S盒查表、线性变换全部在寄存器间完成,最终通过prdata端口以标准APB读响应形式交付。这意味着什么?意味着你在SoC里集成它,就能让任何支持APB主设备(ARM Cortex-M系列、RISC-V APB桥、甚至自研MCU)的系统,在不改驱动、不增固件的前提下,获得硬件级SM4吞吐能力。这不是“加速库”,这是把密码学从软件栈里硬生生抠出来,铸进硅片里的信任根。搞懂它,你就看穿了嵌入式安全芯片里最核心的那层“协议-算法-时序”三角关系。

2. APB总线握手机制:为什么PSELx和PENABLE必须分两拍,而SM4的启动信号text_isvalid_in却要等到PENABLE拉高后才置位?

APB总线不是简单的地址/数据通道,它是一套用时序定义行为的微型状态机。理解apb_slave模块里PSELx与PENABLE的配合逻辑,是解开整个协处理器设计动机的第一把钥匙。

2.1 APB传输的两拍哲学:地址相位与数据相位的严格分离

APB协议强制将一次完整传输拆成两个不可分割的时钟周期:第一拍(Address Phase)仅采样地址和方向信号,第二拍(Data Phase)才进行实际读写。这种设计绝非冗余,而是为了解决总线仲裁与外设响应时间的不确定性。PSELx在地址相位被采样,表示“当前主设备选中本从设备”;而PENABLE仅在数据相位拉高,表示“本次传输正式生效”。看这段关键代码:

always @(posedge PCLK or negedge PRESETN) begin if (!PRESETN) begin // 复位清零 end else if (PSELx && PENABLE && PWRITE) begin // ← 注意:必须同时为真! case (PADDR[7:0]) 8'h00: data1 <= PWDATA; 8'h04: data2 <= PWDATA; 8'h08: data3 <= PWDATA; 8'h0c: begin data4 <= PWDATA; text_isvalid_in = 1'b1; // ← 明文写入完成标志在此刻置位 end // ... 密钥写入同理 endcase end end

这里的关键在于:text_isvalid_in的置位条件是PSELx && PENABLE && PWRITE,而非PSELx && PWRITE。这意味着即使主设备在地址相位就发出了写明文地址0x0c,text_isvalid_in也绝不会在那一拍就变高。它必须等待主设备在下一拍明确拉高PENABLE,确认本次写操作真实发生。这种“延迟确认”机制,给了从设备(即我们的SM4协处理器)一个确定的窗口:只有当PENABLE拉高,才代表地址、数据、方向信号全部稳定且有效,此时更新内部寄存器并触发后续逻辑才是安全的。如果跳过PENABLE直接响应PSELx,一旦主设备因仲裁失败取消本次传输(PENABLE不拉高),协处理器就会误判为一次有效写入,导致数据错乱——这在安全芯片里是致命缺陷。

2.2 SM4启动信号的时序锚点:为什么text_isvalid_in和mk_isvalid_in是“边沿敏感”而非“电平敏感”

text_isvalid_in和mk_isvalid_in这两个信号,表面上是apb_slave模块输出给SM4_U模块的“启动按钮”,但它们的设计远比普通使能信号精妙。它们不是持续有效的电平信号,而是在PENABLE上升沿瞬间产生一个单周期脉冲。看apb_slave中的赋值逻辑:

else if (PSELx && PENABLE && PWRITE) begin case (PADDR[7:0]) 8'h0c: begin data4 <= PWDATA; text_isvalid_in = 1'b1; // ← 在PENABLE有效时,此行执行 end 8'h1c: begin key4 <= PWDATA; mk_isvalid_in = 1'b1; // ← 同理 end endcase end

注意:text_isvalid_in和mk_isvalid_in都是reg类型,且其赋值完全依赖于PENABLE的时序。在下一个时钟沿到来前,只要PENABLE变低(即数据相位结束),这些信号就会因else if条件不满足而保持原值——但更重要的是,在SM4_U模块中,它们被用作异步复位后的首次加载触发条件:

always @ (posedge clk_i or negedge rst_n_i) begin if (~rst_n_i) {MK0,MK1,MK2,MK3} = 0; else begin if (mk_isvalid_in) begin // ← 这里是边沿检测! {MK0,MK1,MK2,MK3} = mk_i; // ... 轮密钥生成 end // ... end end

if (mk_isvalid_in)实质上是在检测mk_isvalid_in从0到1的跳变。因为mk_isvalid_in只在PENABLE有效的一拍内为1,之后立刻回归0,所以这个if语句天然就是一个同步边沿检测器。这种设计规避了电平敏感信号可能带来的毛刺风险:如果mk_isvalid_in是长电平,一旦因布线延迟或电源噪声出现窄脉冲,SM4_U模块可能误触发多次密钥加载,导致轮密钥错乱。而单周期脉冲+边沿检测,确保了密钥和明文的加载严格对应APB总线的每一次有效写操作,这是硬件密码模块可靠性的基石。

2.3 地址映射与数据拼接:为什么明文/密钥要拆成4个32位寄存器,且地址偏移严格为0x00/0x04/0x08/0x0c?

SM4算法处理的是128位(16字节)的明文和128位的密钥,而APB总线的数据宽度是32位(4字节)。这就引出了一个根本性问题:如何在32位总线约束下,无歧义地传递128位数据?答案是显式地址映射 + 硬件拼接。apb_slave模块将128位明文DATA_i拆分为data1~data4四个32位寄存器,并将其映射到连续的APB地址空间:

APB地址偏移寄存器对应128位数据位置作用
0x00data1bits [127:96]明文最高32位
0x04data2bits [95:64]明文次高32位
0x08data3bits [63:32]明文次低32位
0x0cdata4bits [31:0]明文最低32位,写入即触发text_isvalid_in

这种设计有三重深意:

  1. 符合APB规范:APB地址线通常为32位,但实际有效低位由从设备决定。此处只使用低8位(PADDR[7:0]),0x00~0x0c覆盖了4个32位字,是标准做法。
  2. 避免字节序歧义:软件驱动在写入时,必须按大端序(Big-Endian)组织数据——即先写高位字。{data1,data2,data3,data4}的拼接顺序直接决定了DATA_i的比特布局,无需额外的字节序转换逻辑。
  3. 触发时机精准:只有写入最后一个字(0x0c)时,才置位text_isvalid_in。这保证了DATA_i寄存器在text_isvalid_in拉高时,四个字已全部稳定,杜绝了“部分写入就启动”的竞态风险。同理,密钥KEY的key1~key4映射到0x10~0x1c,0x1c写入触发mk_isvalid_in。

提示:这种“分块写入+末位触发”的模式,是硬件协处理器设计的经典范式。它把软件的“原子写128位”语义,映射为硬件可精确控制的4次32位写操作,是软硬协同的典型体现。

3. SM4算法硬件化:S盒查表、轮密钥生成与线性变换,如何在单周期内完成32轮迭代?

SM4的32轮迭代在软件中是循环执行的串行过程,但在硬件中,它被重构为一个深度流水线化的状态机。SM4_U模块的核心并非“循环”,而是“计数+查表+组合逻辑”,其本质是将算法的数学结构直接翻译为门电路。

3.1 S盒:256×8位ROM的物理意义与查表优化

SM4的非线性变换核心是S盒(Substitution Box),一个256项的8位输入/8位输出查找表。在SM4_U模块中,它被声明为:

reg [7:0] Sbox [0:255];

这行代码在综合后,会映射为一块256×8位的只读存储器(ROM)。它的物理意义远不止“存数据”:

  • 面积与速度的权衡:用ROM实现S盒,避免了用组合逻辑(如多级MUX或LUT)实现256种映射所需的大量逻辑资源。虽然ROM占用一定面积,但它提供了单周期查表延迟,这对流水线至关重要。
  • 抗侧信道攻击的基础:ROM查表的访问时间恒定,不随输入数据变化。这使得基于功耗或时序的侧信道分析(如DPA)难以区分不同输入,是硬件密码模块安全性的基本要求。如果用动态计算代替查表,不同输入路径的逻辑深度不同,会引入可观测的时序差异。

查表过程在轮函数中体现为:

{a0,a1,a2,a3} = K[cnt+1] ^ K[cnt+2] ^ K[cnt+3] ^ CK[cnt]; // 计算4个字节的输入 B = {Sbox[a0], Sbox[a1], Sbox[a2], Sbox[a3]}; // 四次并行查表

这里a0~a3是4个独立的8位索引,Sbox[a0]等操作在硬件中是4个并行的ROM访问,可在同一时钟周期内完成。这种并行性是软件无法比拟的。

3.2 轮密钥生成:为什么需要36个32位寄存器K[0:35],且K[0]~K[3]由MK和FK异或得到?

SM4的密钥扩展算法(Key Expansion)需生成32个轮密钥rk[0]~rk[31],每个32位。SM4_U模块用K[0:35]这个36元素数组来存储中间状态,其索引规则直接对应算法公式:

K[i+4] = K[i] ⊕ T'(K[i+1] ⊕ K[i+2] ⊕ K[i+3] ⊕ CK[i])

其中T'是包含S盒查表和线性变换LN的复合函数。K[0:3]是初始密钥材料,由主密钥MK和固定常数FK异或得到:

K[3] = MK3 ^ FK[3]; K[2] = MK2 ^ FK[2]; K[1] = MK1 ^ FK[1]; K[0] = MK0 ^ FK[0];

FK是4个32位的固定常数(FK[0]<=32'hA3B1BAC6;等),用于增强密钥扩展的非线性。K[4]~K[35]则按上述递推公式生成,rk[i]直接取K[i+4]。使用36个寄存器而非32个,是为了在计数器cnt从0遍历到31时,K[cnt+4]始终有有效索引(cnt+4最大为35),避免越界。

3.3 线性变换LN与L:位移与异或的硬件直译

SM4定义了两个关键线性变换:

  • LN(B):用于密钥扩展,LN(B) = B ⊕ (B << 13) ⊕ (B << 23)
  • L(B):用于加密轮函数,L(B) = B ⊕ (B << 2) ⊕ (B << 10) ⊕ (B << 18) ⊕ (B << 24)

在Verilog中,它们被直译为位操作:

// LN(B) for key expansion K[cnt+4] = K[cnt] ^ B[31:0] ^ ({B[18:0], B[31:19]}) ^ ({B[8:0], B[31:9]}); // L(B) for encryption X[cnt+4] = X[cnt] ^ A[31:0] ^ ({A[29:0], A[31:30]}) ^ ({A[21:0], A[31:22]}) ^ ({A[13:0], A[31:14]}) ^ ({A[7:0], A[31:8]});

这里的{B[18:0], B[31:19]}是Verilog的拼接操作,等价于B << 13(左移13位,高位补0,低位丢弃)。所有位移和异或操作在FPGA中由LUT和进位链直接实现,延迟极短(通常1-2个LUT级),是纯组合逻辑。整个32轮迭代,每一轮的计算(查S盒+LN/L+异或)都在一个时钟周期内完成,cnt计数器只是用来选择当前轮使用的寄存器索引,而非控制循环。

4. 协处理器集成与验证:为什么顶层模块top_level是“胶水逻辑”,而testbench必须模拟APB时序细节?

top_level模块本身不包含任何SM4算法逻辑,它纯粹是apb_slave和SM4_U之间的连接枢纽。它的存在,揭示了硬件IP集成的核心思想:功能模块化 + 接口标准化。

4.1 top_level:APB总线与SM4算法核的“协议翻译器”

top_level的职责非常清晰:将APB总线的通用信号(PSELx,PENABLE,PADDR,PWDATA,prdata等)翻译成SM4_U模块所需的专用信号(mk_i,text_i,mk_isvalid_in,text_isvalid_in,dat_o)。看其关键连接:

apb_slave s1( .PSELx(PSELx), .PENABLE(PENABLE), .PADDR(PADDR), .PWRITE(PWRITE), .PRESETN(PRESETN), .PCLK(PCLK), .PWDATA(PWDATA), .prdata(prdata), // ← APB读数据输出 .SM4_DATA(SM4_DATA), // ← SM4加密结果输入 .KEY(KEY), // ← 输出密钥至SM4 .DATA_i(DATA_i), // ← 输出明文至SM4 .mk_isvalid_in(mk_isvalid_in), // ← 输出密钥有效信号 .text_isvalid_in(text_isvalid_in) // ← 输出明文有效信号 ); SM4 s2( .mk_i(KEY), // ← 接收密钥 .text_i(DATA_i), // ← 接收明文 .clk_i(PCLK), // ← 共享时钟 .rst_n_i(PRESETN), // ← 共享复位 .mk_isvalid_in(mk_isvalid_in), // ← 接收密钥有效信号 .text_isvalid_in(text_isvalid_in), // ← 接收明文有效信号 .dat_o(SM4_DATA) // ← 接收加密结果 );

top_level没有算法,只有连线。它证明了一个重要事实:SM4算法核(SM4_U)是完全与总线协议解耦的。你可以轻易地将SM4_U接入AXI总线(只需修改一个类似的axi_slave模块),或者接入自定义的串行接口,而SM4_U本身的RTL代码一行都不用动。这就是IP复用的价值。

4.2 testbench:为什么top_level_tb.v必须精确建模PSELx/PENABLE的时序,而非简单赋值?

验证硬件正确性的testbench,其质量直接决定了设计的可靠性。top_level_tb.v的精妙之处在于,它没有用#delay粗暴地模拟时序,而是严格遵循APB协议:

initial begin PADDR = 8'h00; PRESETN = 0; #100 PRESETN = 1; #100 // 写入明文和密钥 repeat(8) begin PWDATA = mem_word[i]; PWRITE = 1; PSELx = 1; // 地址相位开始 PENABLE = #40 1; // 数据相位:40ns后拉高 #40 PSELx = 0; // 数据相位结束,PSELx变低 PENABLE = 0; #80 // 延迟,准备下一次 PADDR = PADDR + 8'h04; i = i + 4'b1; end end

这段代码精确复现了APB的两拍流程:

  • PSELx = 1模拟地址相位开始。
  • PENABLE = #40 1表示在地址相位后40ns(即半个时钟周期,假设时钟周期80ns),拉高PENABLE,进入数据相位。
  • #40 PSELx = 0和PENABLE = 0在数据相位结束后立即将信号拉低。

如果testbench偷懒,写成PSELx=1; PENABLE=1; #40 PSELx=0; PENABLE=0;,就忽略了地址相位的存在,可能导致apb_slave模块在PENABLE拉高前就错误采样了PADDR,从而写入错误寄存器。真正的硬件验证,必须是协议级的仿真,而非功能级的“差不多就行”。

5. 避坑指南:APB-SM4协处理器开发中5个血泪经验总结

在将这份Verilog代码集成到真实项目时,我踩过不少坑。以下是5个最具代表性的实战问题,每个都附带现象、根因和解决方案,帮你避开我走过的弯路。

5.1 现象:写入密钥后,SM4输出全零,且ready_out始终为0

原因:mk_isvalid_in信号在apb_slave中被错误地声明为wire而非reg,导致在always块中无法赋值,该信号恒为高阻态(Z),SM4_U模块永远收不到密钥有效的通知。
解决:检查apb_slave模块端口声明,确保output reg mk_isvalid_in和output reg text_isvalid_in的reg关键字存在。Verilog中,output默认是wire,必须显式声明为reg才能在always块中驱动。

5.2 现象:加密结果与软件参考实现不一致,但前几轮轮密钥计算正确

原因:SM4_U模块中SboxROM的初始化代码位于always @ (posedge clk_i)块内。这意味着Sbox内容只在第一个时钟上升沿加载,如果复位释放(rst_n_i变高)发生在时钟不稳定期,Sbox可能未被正确初始化,导致查表错误。
解决:将Sbox和CK、FK的初始化移到initial块中(适用于仿真),或在always @ (posedge clk_i or negedge rst_n_i)块中,于rst_n_i为低时进行初始化(适用于FPGA综合)。例如:

always @ (posedge clk_i or negedge rst_n_i) begin if (~rst_n_i) begin // 复位时初始化Sbox(综合工具支持) for (integer i=0; i<256; i=i+1) Sbox[i] <= 8'h00; // ... 初始化CK, FK end else begin // 正常工作逻辑 end end

5.3 现象:APB读操作返回的数据错位,例如地址0x00读出的是DATA_ENC[63:32]而非[127:96]

原因:apb_slave模块中读数据的case语句,对PADDR[7:0]的判断逻辑有误。代码中8'h0c: prdata<=DATA_ENC[31:0];是正确的(0x0c对应最低32位),但如果地址线连接错误(如PADDR[7:0]实际接到了PADDR[15:8]),或case语句的地址偏移写反(如8'h00对应了[31:0]),就会导致错位。
解决:用仿真波形(Waveform)严格比对PADDR信号值与prdata输出值。在case语句中,添加default分支并赋值为prdata <= 32'hDEAD_BEEF;,这样一旦地址非法,会立即在波形中看到明显异常值,便于定位。

5.4 现象:协处理器在连续多次加密时,第二次及以后的结果错误

原因:SM4_U模块的ready_out信号在加密完成后变为高电平,但top_level或apb_slave模块没有在ready_out变高后,自动清除text_isvalid_in和mk_isvalid_in。导致下次写入明文时,SM4_U认为密钥和明文都已有效,直接启动新一轮加密,而此时密钥寄存器可能还未被新值更新完毕,造成数据竞争。
解决:在SM4_U模块中,当carry == 1'b1(32轮完成)时,除了输出dat_o,还应将mk_isvalid_in和text_isvalid_in的内部锁存清零。或者,在apb_slave中,增加一个“忙”状态机,在text_isvalid_in置位后,禁止再次写入,直到SM4_U的ready_out拉高。

5.5 现象:综合后资源占用远超预期,LUT利用率爆表

原因:SM4_U模块中K[0:35]和X[0:35]两个36元素的32位寄存器数组,以及Sbox[0:255]的256×8位ROM,是主要资源消耗者。但更隐蔽的杀手是Sbox查表的驱动逻辑——如果a0~a3的来源(如K[cnt+1])未被正确约束为reg,综合工具可能将其推断为锁存器(Latch),导致面积激增。
解决:在综合约束文件(SDC)中,为SM4_U模块添加面积优化指令(如set_max_area 0),并使用综合报告(Synthesis Report)的Hierarchy视图,定位Sbox和寄存器数组的具体资源占比。对于Sbox,确认其被综合为Block RAM(BRAM)而非分布式RAM(LUTRAM),后者面积更大。可通过在Sbox声明前加(* ram_style = "block" *)属性(Xilinx)或(* syn_ramstyle = "block_ram" *)(Intel)来强制。

6. 设计取舍的再思考:为什么放弃AXI而坚持APB?以及,如何用“Ready-Valid”握手替代APB验证你的理解

选择APB而非更主流的AXI总线,是这份设计最值得玩味的取舍。AXI拥有更高的带宽、支持突发传输、更复杂的QoS机制,但APB的“简陋”恰恰是其在密码协处理器场景下的最优解。

6.1 APB的“慢”,为何是安全芯片的“快”?

AXI总线的复杂性体现在其5个独立通道(AR, AW, W, R, B)和丰富的握手机制(VALID/READY)。这带来了巨大的灵活性,但也引入了不确定性:一次写操作的完成时间取决于仲裁、从设备响应、通道拥塞等多种因素。而APB只有单一的PADDR/PWDATA/PRDATA通道,且其两拍时序是完全确定的:地址相位1拍,数据相位1拍,总共2个时钟周期完成一次32位传输。对于SM4协处理器而言,这意味着:

  • 可预测的启动延迟:从最后一笔密钥写入(0x1c)到ready_out拉高,总延迟 = 2(写密钥)+ 2(写明文)+ 32(轮迭代)= 36个时钟周期,误差为0。这种确定性是实时安全系统(如汽车ECU、工业PLC)的刚需。
  • 极简的验证路径:验证APB从设备,只需关注PSELx、PENABLE、PWRITE三个信号的组合逻辑,而AXI验证需要覆盖所有5个通道的VALID/READY握手、乱序、重试等上百种场景。这份设计的testbench只有50行,而一个等效的AXI testbench往往超过500行。

放弃AXI,不是技术落后,而是用协议的确定性,换取了硬件实现的简洁性、验证的完备性和时序的可预测性。在安全攸关的领域,“简单可控”远胜于“高性能但复杂”。

6.2 进阶验证:用“Ready-Valid”握手重写APB Slave,检验你是否真的吃透了协议本质

要真正掌握这份设计,一个绝佳的练习是:抛弃PSELx/PENABLE,用更通用的“Ready-Valid”握手协议,重写apb_slave的功能。Ready-Valid是数字电路中最基础的流控协议:Valid表示发送方数据有效,Ready表示接收方已准备好,只有两者同时为高,数据才被采样。

你可以定义一个简化版接口:

input logic valid_in, // 替代 PSELx && PENABLE input logic write_in, // 替代 PWRITE input logic [7:0] addr_in, // 替代 PADDR[7:0] input logic [31:0] data_in, // 替代 PWDATA output logic ready_out, // 新增:告诉主设备“我已采样” // ... 其他信号

然后,将原来的PSELx && PENABLE && PWRITE替换为valid_in && write_in,并将ready_out在always块中,于成功采样数据后置高一拍。这个练习会迫使你剥离APB的语法糖,直面其核心:一个确定性的、基于握手的数据传输协议。当你能用Ready-Valid完美复现APB的行为时,你就不再是在“用”APB,而是在“设计”总线协议了。

从那以后我每次做协处理器设计,都强制走一遍“用Ready-Valid重写接口”的流程。它像一面镜子,照出我对协议的理解是停留在抄代码,还是已经内化为设计直觉。希望帮到你。

本文还有配套的精品资源,点击获取

需要专业的网站建设服务?

联系我们获取免费的网站建设咨询和方案报价,让我们帮助您实现业务目标

立即咨询